corruption
type: Concept
narrower: electoral manipulation

electoral manipulation
type: Concept
definition: Transnational crime networks depend on favorable local conditions at the production and distribution ends of their markets. Generating environments that guarantee both a minimum exposure to risks and an optimization of profit starts by ensuring some degree of local control over territories and governance structures. [Source: Encyclopedia of Transnational Crime & Justice; Electoral Manipulation]
broader: corruption

concepts
type: Collection
type: ConceptGroup
member: electoral manipulation