electronic games and aggression
type: Concept
definition: The emergence of new entertainment media has been followed time and again by concern about their potential harmful effects on children and other members of the public. This occurred with the advent of the penny press, dime novels, comic books, film, radio, and television. [Source: Encyclopedia of Children, Adolescents, and the Media; Aggression, Electronic Games and]
broader: violence and aggression

violence and aggression
type: Concept
narrower: electronic games and aggression

concepts
type: Collection
type: ConceptGroup
member: electronic games and aggression