emerging adulthood
type: Concept
definition: The years between adolescence and mature adulthood have come to be labeled “emerging adulthood,” a term coined by psychologist Jeffrey Arnett. Emerging adulthood is a stage in the life course that has resulted in recent decades from a variety of sociohistorical changes. [Source: The Social History of the American Family: An Encyclopedia; Emerging Adulthood]
broader: social development and social behavior

social development and social behavior
type: Concept
narrower: emerging adulthood

concepts
type: Collection
type: ConceptGroup
member: emerging adulthood