empathy
type: Concept
definition: Empathy means to feel into another person's biological processes, perceptions, emotional states, and their kinds and forms of consciousness in order to assess their feelings. Further, empathy means not only assessing another's affective communication, but using one's assessments in order to be eventually helpful to another person's communication development. [Source: Encyclopedia of Communication Theory; Empathy]
broader: emotion

emotion
type: Concept
narrower: empathy

concepts
type: Collection
type: ConceptGroup
member: empathy