equal sacrifice theory
type: Concept
definition: Equal sacrifice theory maintains that all members and sectors of society should make equal sacrifice for the common good. This theory has been critical to political economy since the 18th century, particularly as it pertains to taxation. [Source: Encyclopedia of Business Ethics and Society; Equal Sacrifice Theory]
broader: theories of ethics

theories of ethics
type: Concept
narrower: equal sacrifice theory

concepts
type: Collection
type: ConceptGroup
member: equal sacrifice theory