evolutionary psychology
type: Concept
narrower: error management theory

error management theory
type: Concept
definition: Definition One of the great challenges for humans is figuring out what is going on in other people's minds. People don't always disclose exactly what they are thinking, they can behave in very ambiguous ways, and sometimes they can be downright deceptive. [Source: Encyclopedia of Social Psychology; Error Management Theory]
broader: evolutionary psychology

concepts
type: Collection
type: ConceptGroup
member: error management theory