ethnographic research
type: Concept
definition: Any of several methods of describing social or cultural life based on direct, systematic observation, such as becoming a participant in a social system. Ethnographic methods are most commonly used by anthropologists. [Source: Dictionary of Statistics & Methodology; Ethnographic Research]
broader: inquiry and research

inquiry and research
type: Concept
narrower: ethnographic research

methods
type: Collection
type: ConceptGroup
member: ethnographic research