evaporation
type: Concept
definition: The process by which liquid changes into a gas. It depends upon the vapour pressure of the air, its temperature, wind conditions and the nature of the ground surface. [Source: Encyclopedia of Environmental Change; evaporation]
broader: vaporisation

vaporisation
type: Concept
narrower: evaporation

concepts
type: Collection
type: ConceptGroup
member: evaporation