exchange relationships
type: Concept
definition: The defining characteristic of an exchange relationship is that benefits are given with the expectation of receiving a comparable benefit in return or in repayment for a comparable benefit received in the past. When exchange rules are followed appropriately, each relationship member considers the exchange to be fair. [Source: Encyclopedia of Social Psychology; Exchange Relationships]
broader: interpersonal relationships

interpersonal relationships
type: Concept
narrower: exchange relationships

concepts
type: Collection
type: ConceptGroup
member: exchange relationships