research/theoretical frameworks
type: Concept
narrower: exobiology and exoevolution

concepts
type: Collection
type: ConceptGroup
member: exobiology and exoevolution

exobiology and exoevolution
type: Concept
definition: Exobiology is the scientific search for life-forms existing elsewhere in this universe, whereas exoevolution involves speculating on the adaptive histories of organisms on other worlds. It is not generally known that, at least once in his life, Charles Darwin envisioned the existence of plants and animals on another world. [Source: Encyclopedia of Anthropology; Exobiology and Exoevolution]
broader: research/theoretical frameworks