expectations about relationships
type: Concept
definition: Humans have many expectations for their interpersonal relationships. Relational expectations are assumptions or beliefs about how the self and partner typically think, feel, and behave in relationships, as well as how relationships typically function. [Source: Encyclopedia of Human Relationships; Expectations about Relationships]
broader: cognitive processes in relationships

cognitive processes in relationships
type: Concept
narrower: expectations about relationships

concepts
type: Collection
type: ConceptGroup
member: expectations about relationships