teaching
type: Concept
narrower: expert teachers

expert teachers
type: Concept
definition: A number of forces concerning educational policy have come together to raise the awareness and research concerns over the identification and preparation of expert teachers for America's school systems. Criteria for identifying expert teachers are being identified and studied from different perspectives, including those of teachers, principals, and students, and then examined closely as these research findings are applied to the preparation of future teachers and the induction of beginning teachers into the schools. [Source: Encyclopedia of Educational Psychology; Expert Teachers]
broader: teaching

concepts
type: Collection
type: ConceptGroup
member: expert teachers