extractive reserves
type: Concept
definition: Extractive reserves are territories dedicated to environmental protection and the sustainable use of nature resources by traditional populations. Reserves follow a traditional land tenure model based on individual family and communal property rights to common areas, such as forest trails used to extract or harvest nontimber forest products. [Source: Encyclopedia of Geography; Extractive Reserves]
broader: resources and conservation

resources and conservation
type: Concept
narrower: extractive reserves

concepts
type: Collection
type: ConceptGroup
member: extractive reserves