exurbia
type: Concept
definition: Exurbia is the semiurban, semirural landscape between suburbs and the rural hinterland. It comprises many landscapes including farms, forests, isolated suburban subdivisions, small towns, acreage tract subdivisions, and estates. [Source: The Encyclopedia of Housing; Exurbia]
broader: development patterns

development patterns
type: Concept
narrower: exurbia

concepts
type: Collection
type: ConceptGroup
member: exurbia