fad diets
type: Concept
definition: One might say that fad diets have been around as long as there have been humans who believed that food might in some way be related to health. Over the centuries, and across many cultures, some outrageous things have been ingested with the intent of having an impact on an individual's health and well-being. [Source: Encyclopedia of Lifestyle Medicine & Health; Fad Diets]
broader: food and nutrition

food and nutrition
type: Concept
narrower: fad diets

concepts
type: Collection
type: ConceptGroup
member: fad diets