finance
type: Concept
narrower: fee-for-service payment

fee-for-service payment
type: Concept
definition: Fee-for-service (FFS) payment is the way that professionals in the United States have historically been paid. In the industrial sector, it would be called piecework. [Source: Encyclopedia of Health Care Management; Fee-For-Service (FFS) Payment]
broader: finance

concepts
type: Collection
type: ConceptGroup
member: fee-for-service payment