field relations
type: Concept
definition: The definitive characteristic of social science field research is the encounter between researcher(s) and researched. Encounters in the field may vary from those that are short-lived to those that are sufficiently long-lived to form the basis of ongoing relationships. [Source: The SAGE Encyclopedia of Social Science Research Methods; Field Relations]
broader: field studies

field studies
type: Concept
narrower: field relations

methods
type: Collection
type: ConceptGroup
member: field relations