population crises
type: Concept
narrower: food security

concepts
type: Collection
type: ConceptGroup
member: food security

food security
type: Concept
definition: Food security is a contentious issue, and attempts to define it align with particular approaches to what should be done. At the most basic level, food security indicates access to sufficient, safe, and nutritious food. [Source: Green Food: An A-to-Z Guide; Food Security]
broader: population crises