counterterrorism
type: Concept
narrower: forensic science and terrorism

concepts
type: Collection
type: ConceptGroup
member: forensic science and terrorism

forensic science and terrorism
type: Concept
definition: Forensic science is traditionally that scientific discipline which determines how a crime was committed and submits those findings to courts of law. The focus is the courtroom, and forensic scientists present testimony to clarify what happened, leaving judges and juries to rule on culpability. [Source: The SAGE Encyclopedia of Terrorism; Forensic Science and Terrorism]
broader: counterterrorism