franciscan order
type: Concept
definition: FRANCISCANS ARE members of a Roman Catholic religious order that requires poverty of its members. The men's or First Order was founded by Giovanni Francesco Bernardone, an Italian mystic and preacher, known as St. [Source: Encyclopedia of World Poverty; Franciscan Order]
broader: religious and secular charities

religious and secular charities
type: Concept
narrower: franciscan order

concepts
type: Collection
type: ConceptGroup
member: franciscan order