games communities
type: Concept
definition: Examining the sociological relationship between games and communities has been an important aspect of research within many disciplines. The cultural importance of games can be clearly seen throughout the historical record. [Source: Encyclopedia of Social Networks; Games Communities]
broader: social networking communities

social networking communities
type: Concept
narrower: games communities

concepts
type: Collection
type: ConceptGroup
member: games communities