garbage dreams
type: Concept
definition: Garbage Dreams is a 2009 documentary film directed by Mai Iskander. The film focuses on the zabbaleen, an Egyptian group of Coptic Christians who live on the outskirts of Cairo. [Source: Encyclopedia of Consumption and Waste: The Social Science of Garbage; Garbage Dreams]
broader: sociology of waste

sociology of waste
type: Concept
narrower: garbage dreams

concepts
type: Collection
type: ConceptGroup
member: garbage dreams