gemeinschaft
type: Concept
definition: Gemeinschaft, or “community,” has always been an ambiguous notion. Particularly in the German context, it has been contrasted with the term Gesellschaft (society). [Source: Encyclopedia of Anthropology; Gemeinschaft]
broader: research/theoretical frameworks

research/theoretical frameworks
type: Concept
narrower: gemeinschaft

concepts
type: Collection
type: ConceptGroup
member: gemeinschaft