gender role development
type: Concept
definition: Gender is one of the most central attributes people have and an object of endless interest across all societies. Thus it should not be surprising that children are also aware of gender-related characteristics and quickly come to display those qualities themselves well before their own sexual maturity. [Source: Encyclopedia of Human Development; Gender Role Development]
broader: social development and social behavior

social development and social behavior
type: Concept
narrower: gender role development

concepts
type: Collection
type: ConceptGroup
member: gender role development