geographies of difference
type: Concept
definition: Difference is a measure by which individuals, societies, and even nations seek to distinguish themselves. It is a measure of separation (as being unlike someone) and distinctiveness. [Source: Encyclopedia of Geography; Difference, Geographies of]
broader: human geography theory

human geography theory
type: Concept
narrower: geographies of difference

concepts
type: Collection
type: ConceptGroup
member: geographies of difference