geographies of hate
type: Concept
definition: Postmodern and poststructuralist perspectives continue to strongly influence the humanities and social sciences, revealing unequal power relations between those social groups at “the center” of society and those who traditionally exist at the “margins.” Human geographers are particularly concerned with revealing how notions of place, geographical scale, territorial claims, and social space are implicated in the construction of these “center-margin” identities. Much of this research has focused on the geographies of “race,” gender and sexuality, ethnicity, disability, and other “marginalized” identities that tend to place these groups “outside” long-constructed “norms” of Anglo-American society (usually represented as mostly male, white, Christian, and heterosexual). [Source: Encyclopedia of Geography; Hate, Geographies of]
broader: social geography

social geography
type: Concept
narrower: geographies of hate

concepts
type: Collection
type: ConceptGroup
member: geographies of hate