gifted African Americans
type: Concept
definition: Two significant events occurred in 1954 that had a profound impact on the education of gifted students who were African American. Indisputably, the first was Brown v. Board of Education, Topeka, which required that African Americans receive an equal education in desegregated settings. [Source: Encyclopedia of Giftedness, Creativity, and Talent; African American, Gifted]
broader: population

population
type: Concept
narrower: gifted African Americans

concepts
type: Collection
type: ConceptGroup
member: gifted African Americans