gifted Latinos
type: Concept
definition: The topic of gifted Hispanics and Latino(a)s is one that has received little attention. However, given the growing number of Hispanics in the United States, this issue is of utmost importance. [Source: Encyclopedia of Giftedness, Creativity, and Talent; Hispanic/Latino(a), Gifted]
broader: population

population
type: Concept
narrower: gifted Latinos

concepts
type: Collection
type: ConceptGroup
member: gifted Latinos