international trade
type: Concept
narrower: globalization index

concepts
type: Collection
type: ConceptGroup
member: globalization index

globalization index
type: Concept
definition: According to the Oxford English Dictionary, the use of the term globalization emerged in an article in the October 5, 1962, issue of The Spectator. However, it was not until the early 1980s that the term began to take shape within academia. [Source: Encyclopedia of Business in Today's World; Globalization Index]
broader: international trade