governor
type: Concept
definition: State governors are the chief executives of state governments. In this role, they occupy a similar position to the U.S. president in the institutional hierarchy of government. [Source: Political Encyclopedia of U.S. States and Regions; Governor]
broader: public administration

public administration
type: Concept
narrower: governor

concepts
type: Collection
type: ConceptGroup
member: governor