geomorphology
type: Concept
narrower: gully erosion

concepts
type: Collection
type: ConceptGroup
member: gully erosion

gully erosion
type: Concept
definition: Gully erosion is a phenomenon that can be observed worldwide and is often related to actual or former agricultural land use. Gullies are a form of linear (soil) erosion that emerge due to the erosive power of concentrated overland flow. [Source: Encyclopedia of Geography; Gully Erosion]
broader: geomorphology