concepts
type: Collection
type: ConceptGroup
member: herders

herders
type: Concept
definition: Herders are people whose lives revolve around the tending of animals and who, consequently, tend to have a seminomadic or nomadic lifestyle. They range from shepherds and cowherds who are found in a wide variety of agricultural settings to the reindeer herders of the north to the nomadic steppe tribes of Mongolia and Central Asia. [Source: Encyclopedia of Environment and Society; Herders]
broader: animals

animals
type: Concept
narrower: herders