high-risk situations
type: Concept
definition: High-risk situations refer to any condition that may increase the chance for engagement in any undesirable behavior. In the context of drug and alcohol treatment, a high-risk situation is any cognition, emotion, location, event, or experience that could escalate the potential to use or overuse a substance. [Source: Encyclopedia of Substance Abuse Prevention, Treatment, & Recovery; High-Risk Situations]
broader: relapse prevention

relapse prevention
type: Concept
narrower: high-risk situations

concepts
type: Collection
type: ConceptGroup
member: high-risk situations