historical understanding
type: Concept
definition: Historical understanding (Verstehen) has to do with grasping the intentional content attached to human actions. It is a distinctive approach to the human sciences, typically based on the idea that the meaningful nature of human action requires a distinct epistemology in the form of historical understanding. [Source: Encyclopedia of Political Theory; Historical Understanding]
broader: self and community

self and community
type: Concept
narrower: historical understanding

concepts
type: Collection
type: ConceptGroup
member: historical understanding