recreation
type: Concept
narrower: hobbies

hobbies
type: Concept
definition: Hobbies are activities including crafting, sporting, or gardening that are carried on not as a regular occupation, but primarily for pleasure—as a pastime. The sensibility of having or developing a hobby is relatively new. [Source: Encyclopedia of Play in Today's Society; Hobbies]
broader: recreation

concepts
type: Collection
type: ConceptGroup
member: hobbies