housing codes
type: Concept
definition: Municipalities seek to ensure housing quality through the enforcement of building and housing codes. Building codes establish standards for new construction and remodeling. [Source: The Encyclopedia of Housing; Housing Codes]
broader: housing technology

housing technology
type: Concept
narrower: housing codes

concepts
type: Collection
type: ConceptGroup
member: housing codes