educational philosophy
type: Concept
narrower: humanistic education

humanistic education
type: Concept
alternative label: person-centered education
definition: The term humanistic education has been interpreted by various educators and philosophers over many centuries. Though specific definitions vary widely, several characteristics are commonly agreed upon. [Source: Encyclopedia of Educational Leadership and Administration; Humanistic Education]
broader: educational philosophy

concepts
type: Collection
type: ConceptGroup
member: humanistic education