identity at work
type: Concept
definition: Identity in the workplace refers to the subjective side of employment. In contrast to the material dimensions of work often studied in the labor process (e.g., wages, contracts, and career ladders), identity is an experience and may be harder to measure or see. [Source: Sociology of Work: An Encyclopedia; Identity at Work]
broader: social psychology of work

social psychology of work
type: Concept
narrower: identity at work

concepts
type: Collection
type: ConceptGroup
member: identity at work