the self
type: Concept
narrower: illusion of control

illusion of control
type: Concept
definition: Definition The illusion of control (also known as illusory control) refers to the tendency for people to exaggerate their ability to produce a desired outcome. Even when it comes to controlling random events, people believe they have control. [Source: Encyclopedia of Social Psychology; Illusion of Control]
broader: the self

concepts
type: Collection
type: ConceptGroup
member: illusion of control