aging and the brain
type: Concept
narrower: imaging of the brain

concepts
type: Collection
type: ConceptGroup
member: imaging of the brain

imaging of the brain
type: Concept
definition: Brain imaging is a procedure that allows physicians to examine the structure of the brain or take pictures of how it looks. This is an important tool for the evaluation of brain and neurological disorders, including stroke, seizures, some psychiatric illnesses, and head injuries. [Source: Encyclopedia of Health & Aging; Imaging of the Brain]
broader: aging and the brain