in situ construction
type: Concept
definition: Housing built on-site is sometimes called in situ house construction. This is the dominant method of residential construction, including multifamily housing. [Source: The Encyclopedia of Housing; In Situ Construction]
broader: housing technology

housing technology
type: Concept
narrower: in situ construction

concepts
type: Collection
type: ConceptGroup
member: in situ construction