organization theory
type: Concept
narrower: informal organization

concepts
type: Collection
type: ConceptGroup
member: informal organization

informal organization
type: Concept
definition: The aggregate of personal contacts and interactions and associated groupings of people. Social networks analysis (SNA) studies the informal organization. [Source: Dictionary of Strategy: Strategic Management A-Z; Informal Organization]
broader: organization theory