information technology auditing
type: Concept
definition: Information technology (IT) auditing collects and evaluates data pertaining to an IT infrastructure. An IT audit may augment a financial audit, but it is specifically designed to test the IT infrastructure's accuracy, efficiency, and security. [Source: Encyclopedia of Business in Today's World; Information Technology Auditing]
broader: international accounting

international accounting
type: Concept
narrower: information technology auditing

concepts
type: Collection
type: ConceptGroup
member: information technology auditing