institutionalized text perspectives
type: Concept
definition: Institutionalized text perspectives can be understood as an answer to the following question: What does institutionalized text mean and for whom do such meanings count? The answers to this question are highly dependent upon how one defines text. In curriculum studies, constructions of text in general and of institutionalized text in specific most often fall under two overarching categories. [Source: Encyclopedia of Curriculum Studies; Institutionalized Text Perspectives]
broader: theoretical perspectives

theoretical perspectives
type: Concept
narrower: institutionalized text perspectives

concepts
type: Collection
type: ConceptGroup
member: institutionalized text perspectives