concepts
type: Collection
type: ConceptGroup
member: instructional course design

instructional course design
type: Concept
definition: Instructional course design is a critical process in much human learning. Human learning occurs from a combination of planned and unplanned educational experiences. [Source: Encyclopedia of Distributed Learning; Instructional Course Design]
broader: instructional design

instructional design
type: Concept
narrower: instructional course design