concepts
type: Collection
type: ConceptGroup
member: international labor standards

international labor standards
type: Concept
definition: International labor standards have risen in prominence alongside the dramatic increase in trade in the post–World War II era. While there is no universally agreed-on definition of international labor standards, most widely cited are the core labor standards defined by the International Labor Organization (ILO) in its 1998 Declaration on Fundamental Principles and Rights at Work. [Source: The Encyclopedia of Political Science; International Labor Standards]
broader: international relations

international relations
type: Concept
narrower: international labor standards