human resource development
type: Concept
narrower: international training

international training
type: Concept
definition: In today's competitive global business environment, international human resources management (HRM) systems are of significant importance for developing global managers. International training may be defined as any procedure intended to increase an individual's ability to cope and work in a foreign environment. [Source: Encyclopedia of Business in Today's World; International Training]
broader: human resource development

concepts
type: Collection
type: ConceptGroup
member: international training