media regulation
type: Concept
narrower: internet blocking

concepts
type: Collection
type: ConceptGroup
member: internet blocking

internet blocking
type: Concept
definition: Children's use of the Internet confronts parents with two broad issues of control. One has to do with the content youngsters bring into the house purposefully or accidentally through their online connections. [Source: Encyclopedia of Children, Adolescents, and the Media; Internet Blocking]
broader: media regulation