interpersonal communication styles
type: Concept
definition: Interpersonal communication style is the manner in which one communicates. It includes the way one interacts to create expectations for future behavior on the part of both participants. [Source: Encyclopedia of Industrial and Organizational Psychology; Interpersonal Communication Styles]
broader: groups, teams, and teamwork

groups, teams, and teamwork
type: Concept
narrower: interpersonal communication styles

concepts
type: Collection
type: ConceptGroup
member: interpersonal communication styles