isotropy
type: Concept
definition: Isotropy is a term used in spatial statistical analysis to describe the property of a spatial process that produces outcomes that are independent of direction in space. In science and technology, an isotropic phenomenon is one that appears the same in all directions. [Source: Encyclopedia of Geographic Information Science; Isotropy]
broader: conceptual foundations of GIS

conceptual foundations of GIS
type: Concept
narrower: isotropy

concepts
type: Collection
type: ConceptGroup
member: isotropy